BDBM506793 US11046651, Compound 38
SMILES Cc1ccc2N=C(N3CCN(CC(C)(C)C(O)=O)CC3)c3ccccc3Cc2c1
InChI Key InChIKey=HBZUGNBSIIILGM-UHFFFAOYSA-N
Data  3 KI
  Tab Delimited (TSV)   2D SDfile   Computed 3D by Vconf -m prep SDfile
Find this compound or compounds like it in BindingDB:
Activity Spreadsheet -- Enzyme Inhibition Constant Data from BindingDB
Found 3 hits for monomerid = 506793
Target5-hydroxytryptamine receptor 2C(Homo sapiens (Human))
Alairion
US Patent
LigandPNGBDBM506793(US11046651, Compound 38)
Affinity DataKi:  13nM. Assay description: 1 μL of a compound of the present disclosure the reference compound (Table J) was transferred to an assay plate. 1 μL of 0.2 mM SB-206533 w...
Ligand InfoPC cidPC sid
In DepthDetails US Patent
TargetHistamine H1 receptor(Homo sapiens (Human))
Alairion
US Patent
LigandPNGBDBM506793(US11046651, Compound 38)
Affinity DataKi: >50nM. Assay description: 1 μl of a compounds of the present disclosure and either reference compound (Table C) were transferred to assay plates. 1 μl of 0.2 mM Keta...
Ligand InfoPC cidPC sid
In DepthDetails US Patent
Target5-hydroxytryptamine receptor 2A(Homo sapiens (Human))
Alairion
US Patent
LigandPNGBDBM506793(US11046651, Compound 38)
Affinity DataKi: >50nM. Assay description: 1 μl of a compounds of the present disclosure and either reference compound (Table C) were transferred to assay plates. 1 μl of 0.2 mM Keta...
Ligand InfoPC cidPC sid
In DepthDetails US Patent