BDBM507023 US11046671, VTX-133
SMILES CCCN(CCC)C(=O)C1=Cc2ccc(cc2N=C(N)C1)-c1cccnc1
InChI Key InChIKey=PBBAJCCCVCCZPV-UHFFFAOYSA-N
Data  2 EC50
  Tab Delimited (TSV)   2D SDfile   Computed 3D by Vconf -m prep SDfile
Find this compound or compounds like it in BindingDB:
Activity Spreadsheet -- Enzyme Inhibition Constant Data from BindingDB
Found 1 hit for monomerid = 507023
TargetToll-like receptor 7(Homo sapiens (Human))
Hoffmann-La Roche
US Patent
LigandPNGBDBM507023(US11046671, VTX-133)
Affinity DataEC50:  1.86E+3nM. Assay description: For TLR8 and TLR7 activity testing, HEK-Blue human TLR8 or TLR7 cells (Invivogen, San Diego, Calif., USA) are used, respectively. These cells are des...
Ligand InfoPC cidPC sid
In DepthDetails US Patent