BDBM507027 US11046670, Compound 38
SMILES Clc1cccc(CN2CC[C@@H]3C[C@@H]2c2cc(ccc32)N2CCCCC2)c1
InChI Key InChIKey=KZJJRDZSSLUTQV-WZONZLPQSA-N
Data  2 KI
  Tab Delimited (TSV)   2D SDfile   Computed 3D by Vconf -m prep SDfile
Find this compound or compounds like it in BindingDB:
Activity Spreadsheet -- Enzyme Inhibition Constant Data from BindingDB
Found 2 hits for monomerid = 507027
TargetSigma intracellular receptor 2(Homo sapiens (Human))
Board of Regents, The University of Texas System
US Patent
LigandPNGBDBM507027(US11046670, Compound 38)
Affinity DataKi:  746nM
Ligand InfoPC cidPC sid
In DepthDetails US Patent
TargetSigma non-opioid intracellular receptor 1(Homo sapiens (Human))
Board of Regents, The University of Texas System
US Patent
LigandPNGBDBM507027(US11046670, Compound 38)
Affinity DataKi:  3.52E+3nM. Assay description: Receptor binding assays were performed by the Psychoactive Drug Screening Program (PDSP) at Chapel Hill, N.C. The assay protocol book can be accessed...
Ligand InfoPC cidPC sid
In DepthDetails US Patent