BDBM507031 US11046670, Compound 43
SMILES CN1CC[C@@H]2C[C@@H]1c1cc(ccc21)-c1cccc(C)c1
InChI Key InChIKey=OCAZOEMBQJUTFQ-VQIMIIECSA-N
Data  2 KI
  Tab Delimited (TSV)   2D SDfile   Computed 3D by Vconf -m prep SDfile
Find this compound or compounds like it in BindingDB:
Activity Spreadsheet -- Enzyme Inhibition Constant Data from BindingDB
Found 2 hits for monomerid = 507031
TargetSigma intracellular receptor 2(Homo sapiens (Human))
Board of Regents, The University of Texas System
US Patent
LigandPNGBDBM507031(US11046670, Compound 43)
Affinity DataKi:  133nM
Ligand InfoPC cidPC sid
In DepthDetails US Patent
TargetSigma non-opioid intracellular receptor 1(Homo sapiens (Human))
Board of Regents, The University of Texas System
US Patent
LigandPNGBDBM507031(US11046670, Compound 43)
Affinity DataKi:  391nM. Assay description: Receptor binding assays were performed by the Psychoactive Drug Screening Program (PDSP) at Chapel Hill, N.C. The assay protocol book can be accessed...
Ligand InfoPC cidPC sid
In DepthDetails US Patent