BDBM507128 US11046675, Example 1007
SMILES COC(=O)c1cncc(COc2cc(OCc3cccc(c3C)-c3cccc(OCCCN4CC[C@@H](O)C4)c3C)c(Cl)c3CCN(CC(O)=O)Cc23)c1
InChI Key InChIKey=MRRXWQLSMSWPJQ-WJOKGBTCSA-N
Data  1 IC50
  Tab Delimited (TSV)   2D SDfile   Computed 3D by Vconf -m prep SDfile
Find this compound or compounds like it in BindingDB:
Activity Spreadsheet -- Enzyme Inhibition Constant Data from BindingDB
Found 1 hit for monomerid = 507128
LigandPNGBDBM507128(US11046675, Example 1007)
Affinity DataIC50:  33nM. Assay description: The interaction of PD-1 and PD-L1 can be assessed using soluble, purified preparations of the extracellular domains of the two proteins. The PD-1 and...
Ligand InfoPC cidPC sid
In DepthDetails US Patent