BDBM510524 US11078182, Ex. 1.10
SMILES CN([C@H]1CCN(C1)C(=O)c1ccc(NC(C)(C)C)nc1)C(=O)C1CCOC1
InChI Key InChIKey=FLNNLNMMUCDSMY-LYKKTTPLSA-N
Data  1 IC50
  Tab Delimited (TSV)   2D SDfile   Computed 3D by Vconf -m prep SDfile
Find this compound or compounds like it in BindingDB:
Activity Spreadsheet -- Enzyme Inhibition Constant Data from BindingDB
Found 1 hit for monomerid = 510524
TargetPantetheinase [22-493](Homo sapiens (Human))
Boehringer Ingelheim International
US Patent
LigandPNGBDBM510524(US11078182, Ex. 1.10)
Affinity DataIC50:  0.400nM. Assay description: 0.1 nM of FLAG-tagged Vanin-1 (AA 22-493, T26I, produced internally) and test compounds are incubated at room temperature for 20 minutes in assay buf...
Ligand InfoPC cidPC sid
In DepthDetails US Patent