BDBM512810 WO2021219089, INSCoV-600R (2B)
SMILES FC1(F)CCC(CC1)NC(=O)[C@H](N(C(=O)[C@H]1CO1)c1ccc(cc1)-c1cnco1)c1cncnc1
InChI Key InChIKey=CINPSCMZXLASLP-NHCUHLMSSA-N
Data  1 IC50
  Tab Delimited (TSV)   2D SDfile   Computed 3D by Vconf -m prep SDfile
Find this compound or compounds like it in BindingDB:
Activity Spreadsheet -- Enzyme Inhibition Constant Data from BindingDB
Found 1 hit for monomerid = 512810
TargetReplicase polyprotein 1ab(2019-nCoV)
Insilico Medicine Ip
WIPO
LigandPNGBDBM512810(WO2021219089, INSCoV-600R (2B))
Affinity DataIC50: >2.50E+4nM. Assay description: he C-His6-tagged SARS-CoV-2 M PRO (NC_045512) was cloned, expressed in E. coli and purified by WuXi. The substrate of Dabcyl-KTSAVLQ‖SGFRKME- (...
Ligand InfoPC cidPC sid
In DepthDetails PubMed