BDBM513883 US11059818, Example 9
SMILES Nc1cc(C(CCCc2cccc3ccccc23)c2cnn(Cc3ccc4CNCCc4c3)c2)c2nn[nH]c2n1
InChI Key
Data  2 IC50
  Tab Delimited (TSV)   2D SDfile   Computed 3D by Vconf -m prep SDfile
Find this compound or compounds like it in BindingDB:
Activity Spreadsheet -- Enzyme Inhibition Constant Data from BindingDB
Found 2 hits for monomerid = 513883
TargetMyeloperoxidase(Homo sapiens (Human))
Bristol-Myers Squibb
US Patent
LigandPNGBDBM513883(US11059818, Example 9)
Affinity DataIC50:  50nM. Assay description: MPO chlorination activity was measured in 100 mM KPi (pH 7.4) by utilizing the non-fluorescent reagent Aminophenyl fluorescein (APF, Invitrogen Cat. ...
Ligand InfoPC cidPC sid
In DepthDetails US Patent
TargetMyeloperoxidase(Homo sapiens (Human))
Bristol-Myers Squibb
US Patent
LigandPNGBDBM513883(US11059818, Example 9)
Affinity DataIC50:  5.50E+3nM. Assay description: MPO peroxidation activity was measured in 100 mM KPi (pH 7.4) by utilizing the non-fluorescent reagent Amplex Red (Invitrogen Cat. #A12222) which can...
Ligand InfoPC cidPC sid
In DepthDetails US Patent