BDBM514009 US11059827, Compound 15
SMILES NC(=O)c1cc(F)cc(c1)[C@H]1C[C@H](F)CN1Cc1nc2c(cnn2cc1F)C#N
InChI Key InChIKey=SASKYSGYJPWKBF-WMLDXEAASA-N
Data  1 IC50
  Tab Delimited (TSV)   2D SDfile   Computed 3D by Vconf -m prep SDfile
Find this compound or compounds like it in BindingDB:
Activity Spreadsheet -- Enzyme Inhibition Constant Data from BindingDB
Found 1 hit for monomerid = 514009
TargetHigh affinity nerve growth factor receptor(Homo sapiens (Human))
Blueprint Medicines
US Patent
LigandPNGBDBM514009(US11059827, Compound 15)
Affinity DataIC50: <100nM. Assay description: In each well of a 384-well plate, 1 nM-1.5 nM of wild type NTRK1 enzyme (BPS Bioscience; 40280) was incubated in a total of 12.5 μL of buffer (1...
Ligand InfoPC cidPC sid
In DepthDetails US Patent