BDBM514121 US11052091, Example 1
SMILES CC(C)(C)n1c2nc(Nc3ccc(cc3F)S(C)(=O)=O)nc(N)c2n(-c2ccc(F)c3[nH]ncc23)c1=O
InChI Key InChIKey=VIRLDRGFNVRSBP-UHFFFAOYSA-N
Data  1 IC50
  Tab Delimited (TSV)   2D SDfile   Computed 3D by Vconf -m prep SDfile
Find this compound or compounds like it in BindingDB:
Activity Spreadsheet -- Enzyme Inhibition Constant Data from BindingDB
Found 1 hit for monomerid = 514121
TargetProtein-tyrosine kinase 6(Homo sapiens (Human))
Ono Pharmaceutical
US Patent
LigandPNGBDBM514121(US11052091, Example 1)
Affinity DataIC50:  7nM. Assay description: Measurement of an inhibitory activity on Brk enzyme was performed by using LanthaScreen (registered trademark) system (Invitrogen) in accordance with...
Ligand InfoPC cidPC sid
In DepthDetails US Patent