BDBM514135 US11052091, Example 5-17
SMILES CC(C)n1c2nc(Nc3ccc4C(=O)N(C)Cc4c3)nc(N)c2n(-c2ccc3[nH]ccc3c2)c1=O
InChI Key InChIKey=KMPLGCVHCVPVFO-UHFFFAOYSA-N
Data  1 IC50
  Tab Delimited (TSV)   2D SDfile   Computed 3D by Vconf -m prep SDfile
Find this compound or compounds like it in BindingDB:
Activity Spreadsheet -- Enzyme Inhibition Constant Data from BindingDB
Found 1 hit for monomerid = 514135
TargetProtein-tyrosine kinase 6(Homo sapiens (Human))
Ono Pharmaceutical
US Patent
LigandPNGBDBM514135(US11052091, Example 5-17)
Affinity DataIC50:  3nM. Assay description: Measurement of an inhibitory activity on Brk enzyme was performed by using LanthaScreen (registered trademark) system (Invitrogen) in accordance with...
Ligand InfoPC cidPC sid
In DepthDetails US Patent