BDBM514137 US11052091, Example 5-19
SMILES CC(C)n1c2nc(Nc3ccc(cc3F)C(=O)N(C)C)nc(N)c2n(-c2ccc3[nH]ccc3c2)c1=O
InChI Key InChIKey=RRKMZDXKZYGBNP-UHFFFAOYSA-N
Data  1 IC50
  Tab Delimited (TSV)   2D SDfile   Computed 3D by Vconf -m prep SDfile
Find this compound or compounds like it in BindingDB:
Activity Spreadsheet -- Enzyme Inhibition Constant Data from BindingDB
Found 1 hit for monomerid = 514137
TargetProtein-tyrosine kinase 6(Homo sapiens (Human))
Ono Pharmaceutical
US Patent
LigandPNGBDBM514137(US11052091, Example 5-19)
Affinity DataIC50:  3nM. Assay description: Measurement of an inhibitory activity on Brk enzyme was performed by using LanthaScreen (registered trademark) system (Invitrogen) in accordance with...
Ligand InfoPC cidPC sid
In DepthDetails US Patent