BDBM514225 N-(1-cyanopyrrolidin-3-yl)-2'- methoxy-[1,1'-biphenyl]-4- carboxamide::US11053198, Example 14::US11390584, Example 14
SMILES COc1ccccc1-c1ccc(cc1)C(=O)N[C@@H]1CCN(C1)C#N
InChI Key InChIKey=OEFLRUHQLFMJQR-MRXNPFEDSA-N
Data  2 IC50
  Tab Delimited (TSV)   2D SDfile   Computed 3D by Vconf -m prep SDfile
Find this compound or compounds like it in BindingDB:
Activity Spreadsheet -- Enzyme Inhibition Constant Data from BindingDB
Found 2 hits for monomerid = 514225
TargetUbiquitin carboxyl-terminal hydrolase 30(Homo sapiens (Human))
Mission Therapeutics
US Patent
LigandPNGBDBM514225(N-(1-cyanopyrrolidin-3-yl)-2'- methoxy-[1,1'-biphe...)
Affinity DataIC50: <100nM. Assay description: Dilution plates were prepared at 21 times the final concentration (2100 μM for a final concentration of 100 μM) in 50% DMSO in a 96-well po...
Ligand InfoPC cidPC sid
In DepthDetails US Patent
TargetUbiquitin carboxyl-terminal hydrolase 30(Homo sapiens (Human))
Mission Therapeutics
US Patent
LigandPNGBDBM514225(N-(1-cyanopyrrolidin-3-yl)-2'- methoxy-[1,1'-biphe...)
Affinity DataIC50: <100nM. Assay description: Dilution plates were prepared at 21 times the final concentration (2100 μM for a final concentration of 100 μM) in 50% DMSO in a 96-well po...
Ligand InfoPC cidPC sid
In DepthDetails US Patent