BDBM515329 US11110088, Compound Table 1.3
SMILES COc1cc(ccc1C(=O)Nc1ccccn1)-c1nc([C@H](C)N(C)C(=O)C#CC)n2ccnc(N)c12
InChI Key InChIKey=DJKOMFSZAABEBE-INIZCTEOSA-N
Data  6 IC50
  Tab Delimited (TSV)   2D SDfile   Computed 3D by Vconf -m prep SDfile
Find this compound or compounds like it in BindingDB:
Activity Spreadsheet -- Enzyme Inhibition Constant Data from BindingDB
Found 6 hits for monomerid = 515329
TargetTyrosine-protein kinase BTK(Homo sapiens (Human))
Acerta Pharma
US Patent
LigandPNGBDBM515329(US11110088, Compound Table 1.3)
Affinity DataIC50:  2nM. Assay description: BTK enzyme activity is measured using the IMAP (immobilized metal ion affinity-based fluorescence polarization) assay as outlined below.BTK enzyme (H...
Ligand InfoPC cidPC sid
In DepthDetails US Patent
TargetEpidermal growth factor receptor(Homo sapiens (Human))
Acerta Pharma
US Patent
LigandPNGBDBM515329(US11110088, Compound Table 1.3)
Affinity DataIC50: >1.00E+3nM. Assay description: EGFR enzyme activity is measured using the IMAP (immobilized metal ion affinity-based fluorescence polarization) assay as outlined below.EGFR enzyme ...
Ligand InfoPC cidPC sid
In DepthDetails US Patent
TargetCytoplasmic tyrosine-protein kinase BMX(Homo sapiens (Human))
Acerta Pharma
US Patent
LigandPNGBDBM515329(US11110088, Compound Table 1.3)
Affinity DataIC50:  4.20nM. Assay description: BMX enzyme (Millipore #14-499M), is diluted to 0.5 U/mL in KR buffer (10 mM Tris-HCl, 10 mM MgCl2, 0.01% Tween-20, 0.1% NaN3, 1 mM DTT, 2 mM MnCl2, p...
Ligand InfoPC cidPC sid
In DepthDetails US Patent
TargetTyrosine-protein kinase TXK(Homo sapiens (Human))
Acerta Pharma
US Patent
LigandPNGBDBM515329(US11110088, Compound Table 1.3)
Affinity DataIC50:  3nM. Assay description: TXK enzyme activity is measured using the IMAP (immobilized metal ion affinity-based fluorescence polarization) assay as outlined below.TXK enzyme (M...
Ligand InfoPC cidPC sid
In DepthDetails US Patent
TargetTyrosine-protein kinase ITK/TSK(Homo sapiens (Human))
Acerta Pharma
US Patent
LigandPNGBDBM515329(US11110088, Compound Table 1.3)
Affinity DataIC50: >1.00E+3nM. Assay description: ITK enzyme activity is measured using the IMAP (immobilized metal ion affinity-based fluorescence polarization) assay as outlined below.ITK enzyme (M...
Ligand InfoPC cidPC sid
In DepthDetails US Patent
TargetTyrosine-protein kinase Tec(Homo sapiens (Human))
Acerta Pharma
US Patent
LigandPNGBDBM515329(US11110088, Compound Table 1.3)
Affinity DataIC50:  2.5nM. Assay description: TEC enzyme (Millipore #14-801M), is diluted to 2 U/mL in KR buffer (10 mM Tris-HCl, 10 mM MgCl2, 0.01% Tween-20, 0.1% NaN3, 1 mM DTT, 2 mM MnCl2, pH ...
Ligand InfoPC cidPC sid
In DepthDetails US Patent