BDBM516889 US11104665, Example 2.4
SMILES CC(=O)N1CCN(CC1)c1ccc(CNc2ccc(OCc3ccccc3)nn2)cc1
InChI Key InChIKey=LBHAZZPPNPJPNQ-UHFFFAOYSA-N
Data  1 IC50
  Tab Delimited (TSV)   2D SDfile   Computed 3D by Vconf -m prep SDfile
Find this compound or compounds like it in BindingDB:
Activity Spreadsheet -- Enzyme Inhibition Constant Data from BindingDB
Found 1 hit for monomerid = 516889
TargetEctonucleotide pyrophosphatase/phosphodiesterase family member 2(Homo sapiens (Human))
Boehringer Ingelheim International
US Patent
LigandPNGBDBM516889(US11104665, Example 2.4)
Affinity DataIC50:  3nM. Assay description: 5 nM recombinant ATX (Cayman Chemicals) was supplemented to 50 mM Tris buffer (pH 8.0) containing 3 mM KCl, 1 mM CaCl2, 1 mM MgCl2 0.14 mM NaCl, and ...
Ligand InfoPC cidPC sid
In DepthDetails US Patent