BDBM51806 6,7-dimethoxy-3-(4-methoxybenzyl)-2-[(2-methylbenzyl)sulfanyl]-4(3H)-quinazolinimine::6,7-dimethoxy-3-[(4-methoxyphenyl)methyl]-2-[(2-methylphenyl)methylsulfanyl]quinazolin-4-imine::6,7-dimethoxy-3-[(4-methoxyphenyl)methyl]-2-[(2-methylphenyl)methylthio]-4-quinazolinimine::MLS000546608::SMR000180006::[6,7-dimethoxy-2-[(2-methylbenzyl)thio]-3-p-anisyl-quinazolin-4-ylidene]amine::cid_1482682
SMILES COc1ccc(Cn2c(SCc3ccccc3C)nc3cc(OC)c(OC)cc3c2=N)cc1
InChI Key InChIKey=WBZYJUTYGQVPOY-UHFFFAOYSA-N
Data  3 IC50  2 EC50
  Tab Delimited (TSV)   2D SDfile   Computed 3D by Vconf -m prep SDfile
Find this compound or compounds like it in BindingDB:
Activity Spreadsheet -- Enzyme Inhibition Constant Data from BindingDB
Found 5 hits for monomerid = 51806
LigandPNGBDBM51806(6,7-dimethoxy-3-(4-methoxybenzyl)-2-[(2-methylbenz...)
Affinity DataEC50:  3.00E+4nM. Assay description: University of New Mexico Assay Overview: Assay Support: 1R03MH084830-01 Project Title: TR-FRET HTS Assay for Inhibitors of MEKK2-MEK5 PB1 Domain...
In DepthDetails PCBioAssay
LigandPNGBDBM51806(6,7-dimethoxy-3-(4-methoxybenzyl)-2-[(2-methylbenz...)
Affinity DataEC50:  3.00E+4nM. Assay description: University of New Mexico Assay Overview: Assay Support: 1R03MH084830-01 Project Title: TR-FRET HTS Assay for Inhibitors of MEKK2-MEK5 PB1 Domain...
In DepthDetails PCBioAssay
TargetDNA damage-inducible transcript 3 protein(Mus musculus)
Emory University
Curated by PubChem BioAssay
LigandPNGBDBM51806(6,7-dimethoxy-3-(4-methoxybenzyl)-2-[(2-methylbenz...)
Affinity DataIC50:  9.22E+3nM. Assay description: NIH Molecular Libraries Screening Centers Network [MLSCN] Emory Chemical Biology Discovery Center in MLSCN Assay provider: Dr. Randal Kaufman, Univer...
In DepthDetails PCBioAssay
TargetX-box-binding protein 1(Homo sapiens (Human))
Emory University
Curated by PubChem BioAssay
LigandPNGBDBM51806(6,7-dimethoxy-3-(4-methoxybenzyl)-2-[(2-methylbenz...)
Affinity DataIC50:  1.00E+4nM. Assay description: NIH Molecular Libraries Screening Centers Network [MLSCN] Emory Chemical Biology Discovery Center in MLSCN Assay provider: Dr. Randal Kaufman, Univer...
In DepthDetails PCBioAssay
TargetDNA damage-inducible transcript 3 protein(Mus musculus)
Emory University
Curated by PubChem BioAssay
LigandPNGBDBM51806(6,7-dimethoxy-3-(4-methoxybenzyl)-2-[(2-methylbenz...)
Affinity DataIC50:  9.22E+3nM. Assay description: NIH Molecular Libraries Screening Centers Network [MLSCN] Emory Chemical Biology Discovery Center in MLSCN Assay provider: Dr. Randal Kaufman, Univer...
In DepthDetails PCBioAssay