BDBM51814 (2-butyltetrazol-5-yl)-[dibutoxyphosphoryl-(4-fluorophenyl)methyl]amine::2-butyl-N-[dibutoxyphosphoryl-(4-fluorophenyl)methyl]-1,2,3,4-tetrazol-5-amine::2-butyl-N-[dibutoxyphosphoryl-(4-fluorophenyl)methyl]-5-tetrazolamine::2-butyl-N-[dibutoxyphosphoryl-(4-fluorophenyl)methyl]tetrazol-5-amine::MLS000588973::SMR000212637::[(2-Butyl-2H-tetrazol-5-ylamino)-(4-fluoro-phenyl)-methyl]-phosphonic acid dibutyl ester::cid_4689210
SMILES CCCCOP(=O)(OCCCC)C(Nc1nnn(CCCC)n1)c1ccc(F)cc1
InChI Key InChIKey=YPXGBVPOSFVDRO-UHFFFAOYSA-N
Data  3 IC50  2 EC50
  Tab Delimited (TSV)   2D SDfile   Computed 3D by Vconf -m prep SDfile
Find this compound or compounds like it in BindingDB:
Activity Spreadsheet -- Enzyme Inhibition Constant Data from BindingDB
Found 5 hits for monomerid = 51814
LigandPNGBDBM51814((2-butyltetrazol-5-yl)-[dibutoxyphosphoryl-(4-fluo...)
Affinity DataEC50:  3.00E+4nM. Assay description: University of New Mexico Assay Overview: Assay Support: 1R03MH084830-01 Project Title: TR-FRET HTS Assay for Inhibitors of MEKK2-MEK5 PB1 Domain...
In DepthDetails PCBioAssay
LigandPNGBDBM51814((2-butyltetrazol-5-yl)-[dibutoxyphosphoryl-(4-fluo...)
Affinity DataEC50:  3.00E+4nM. Assay description: University of New Mexico Assay Overview: Assay Support: 1R03MH084830-01 Project Title: TR-FRET HTS Assay for Inhibitors of MEKK2-MEK5 PB1 Domain...
In DepthDetails PCBioAssay
TargetDNA damage-inducible transcript 3 protein(Mus musculus)
Emory University
Curated by PubChem BioAssay
LigandPNGBDBM51814((2-butyltetrazol-5-yl)-[dibutoxyphosphoryl-(4-fluo...)
Affinity DataIC50:  3.13E+3nM. Assay description: NIH Molecular Libraries Screening Centers Network [MLSCN] Emory Chemical Biology Discovery Center in MLSCN Assay provider: Dr. Randal Kaufman, Univer...
In DepthDetails PCBioAssay
TargetX-box-binding protein 1(Homo sapiens (Human))
Emory University
Curated by PubChem BioAssay
LigandPNGBDBM51814((2-butyltetrazol-5-yl)-[dibutoxyphosphoryl-(4-fluo...)
Affinity DataIC50:  870nM. Assay description: NIH Molecular Libraries Screening Centers Network [MLSCN] Emory Chemical Biology Discovery Center in MLSCN Assay provider: Dr. Randal Kaufman, Univer...
In DepthDetails PCBioAssay
TargetDNA damage-inducible transcript 3 protein(Mus musculus)
Emory University
Curated by PubChem BioAssay
LigandPNGBDBM51814((2-butyltetrazol-5-yl)-[dibutoxyphosphoryl-(4-fluo...)
Affinity DataIC50:  3.13E+3nM. Assay description: NIH Molecular Libraries Screening Centers Network [MLSCN] Emory Chemical Biology Discovery Center in MLSCN Assay provider: Dr. Randal Kaufman, Univer...
In DepthDetails PCBioAssay