BDBM520002 4′-((S)-7-(((R)-6-(2-chloro-4-fluorophenyl)-5-(methoxycarbonyl)-2-(thiazol-2-yl)-3,6-dihydropyrimidin-4-yl)methyl)-3-oxohexahydroimidazo[1,5-a]pyrazin-2(3H)-yl)-2′,3-difluoro-[1,1′-diphenyl]-4-carboxylic acid::US11142527, Example 34
SMILES COC(=O)C1=C(CN2CCN3[C@H](CN(C3=O)c3ccc(c(F)c3)-c3ccc(C(O)=O)c(F)c3)C2)NC(=N[C@H]1c1ccc(F)cc1Cl)c1nccs1
InChI Key InChIKey=IAEPXAKYDTZCPZ-JRPXNJEYSA-N
Data  1 EC50
  Tab Delimited (TSV)   2D SDfile   Computed 3D by Vconf -m prep SDfile
Find this compound or compounds like it in BindingDB:
Activity Spreadsheet -- Enzyme Inhibition Constant Data from BindingDB
Found 1 hit for monomerid = 520002
TargetLarge envelope protein(Hepatitis B virus)
Sunshine Lake Pharma
US Patent
LigandPNGBDBM520002(4′-((S)-7-(((R)-6-(2-chloro-4-fluorophenyl)-...)
Affinity DataEC50:  7nM. Assay description: 8000 HepG 2.2.15 cells per well were seeded into a 96-well plate, the plate was cultured at 37° C. and 5% CO2 for 3 days till the cells grew to full ...
Ligand InfoPC cidPC sid
In DepthDetails US Patent