BDBM520042 (R)-methyl 4-(2-chloro-4-fluorophenyl)-6-(((S)-2-(4-(4-cyanophenoxy)benzyl)-3-oxohexahydroimidazo[1,5-a]pyrazin-7(1H)-yl)methyl)-2-(thiazol-2-yl)-1,4-dihydropyrimidine-5-carboxylate::US11142527, Example 102
SMILES COC(=O)C1=C(CN2CCN3[C@H](CN(Cc4ccc(Oc5ccc(cc5)C#N)cc4)C3=O)C2)NC(=N[C@H]1c1ccc(F)cc1Cl)c1nccs1
InChI Key InChIKey=GTPUYKSGCWVIIJ-UKJJDJLKSA-N
Data  1 EC50
  Tab Delimited (TSV)   2D SDfile   Computed 3D by Vconf -m prep SDfile
Find this compound or compounds like it in BindingDB:
Activity Spreadsheet -- Enzyme Inhibition Constant Data from BindingDB
Found 1 hit for monomerid = 520042
TargetLarge envelope protein(Hepatitis B virus)
Sunshine Lake Pharma
US Patent
LigandPNGBDBM520042((R)-methyl 4-(2-chloro-4-fluorophenyl)-6-(((S)-2-(...)
Affinity DataEC50:  4.20nM. Assay description: 8000 HepG 2.2.15 cells per well were seeded into a 96-well plate, the plate was cultured at 37° C. and 5% CO2 for 3 days till the cells grew to full ...
Ligand InfoPC cidPC sid
In DepthDetails US Patent