BDBM520621 1-methyl-5-(2,3,5,6-tetrafluoro-[1,1'-biphenyl]-4-yl)-1H-benzo[d][1,2,3]triazole- 7-carboxylic acid;::US11147801, Compound 19
SMILES Cn1nnc2cc(cc(C(O)=O)c12)-c1c(F)c(F)c(-c2ccccc2)c(F)c1F
InChI Key InChIKey=GBPUGCIDDBWGOK-UHFFFAOYSA-N
Data  1 IC50
  Tab Delimited (TSV)   2D SDfile   Computed 3D by Vconf -m prep SDfile
Find this compound or compounds like it in BindingDB:
Activity Spreadsheet -- Enzyme Inhibition Constant Data from BindingDB
Found 1 hit for monomerid = 520621
TargetDihydroorotate dehydrogenase (quinone), mitochondrial(Homo sapiens (Human))
Aurigene Discovery Technologies
US Patent
LigandPNGBDBM520621(1-methyl-5-(2,3,5,6-tetrafluoro-[1,1'-biphenyl]-4-...)
Affinity DataIC50: <100nM. Assay description: The DHODH activity assay is a coupled enzyme assay in which oxidation of DHO and subsequent reduction of ubiquinone are stoichiometrically equivalent...
Ligand InfoPC cidPC sid
In DepthDetails US Patent