BDBM520634 5-(3'-((dimethylamino)methyl)-2,3,5,6-tetrafluoro-[1,1'-biphenyl]-4-yl)-1-methyl- 1H-benzo[d][1,2,3]triazole-7-carboxylic acid,::US11147801, Compound 40
SMILES CN(C)Cc1cccc(c1)-c1c(F)c(F)c(-c2cc(C(O)=O)c3n(C)nnc3c2)c(F)c1F
InChI Key InChIKey=NCGJADVWXPGHFL-UHFFFAOYSA-N
Data  1 IC50
  Tab Delimited (TSV)   2D SDfile   Computed 3D by Vconf -m prep SDfile
Find this compound or compounds like it in BindingDB:
Activity Spreadsheet -- Enzyme Inhibition Constant Data from BindingDB
Found 1 hit for monomerid = 520634
TargetDihydroorotate dehydrogenase (quinone), mitochondrial(Homo sapiens (Human))
Aurigene Discovery Technologies
US Patent
LigandPNGBDBM520634(5-(3'-((dimethylamino)methyl)-2,3,5,6-tetrafluoro-...)
Affinity DataIC50:  550nM. Assay description: The DHODH activity assay is a coupled enzyme assay in which oxidation of DHO and subsequent reduction of ubiquinone are stoichiometrically equivalent...
Ligand InfoPC cidPC sid
In DepthDetails US Patent