BDBM521553 Isopropyl ((((2R,3 S,4R,5R)-5-(4-aminopyrrolo[2,1-f][1,2,4]triazin-7-yl)-2-azido-5-cyano-3,4-dihydroxytetrahydrofuran-2-yl)methoxy)(phenoxy)phosphoryl)-D-alaninate::US11149049, No. 11
SMILES CC(C)OC(=O)[C@@H](C)NP(=O)(OC[C@]1(O[C@](C#N)([C@H](O)[C@@H]1O)c1ccc2c(N)ncnn12)N=[N+]=[N-])Oc1ccccc1
InChI Key InChIKey=VZNRQEOYLVAVNP-YTWYTYKASA-N
Data  3 EC50
  Tab Delimited (TSV)   2D SDfile   Computed 3D by Vconf -m prep SDfile
Find this compound or compounds like it in BindingDB:
Activity Spreadsheet -- Enzyme Inhibition Constant Data from BindingDB
Found 3 hits for monomerid = 521553
TargetGenome polyprotein(HRV-1B)
Janssen Biopharma
US Patent
LigandPNGBDBM521553(Isopropyl ((((2R,3 S,4R,5R)-5-(4-aminopyrrolo[2,1-...)
Affinity DataEC50: >1.00E+5nM. Assay description: HeLa-OHIO cells (Sigma-Aldrich, St. Louis, Mo.) were plated in 96 well plates at a density of 1.5×105 cells per well in assay media (MEM without phen...
Ligand InfoPC cidPC sid
In DepthDetails US Patent
TargetRous sarcoma virus integrase(Rous sarcoma virus (strain Prague C) (RSV-PrC))
Janssen Biopharma
US Patent
LigandPNGBDBM521553(Isopropyl ((((2R,3 S,4R,5R)-5-(4-aminopyrrolo[2,1-...)
Affinity DataEC50:  1.30E+3nM. Assay description: The HeLa-derived cells containing the stable RSV replicon were cultured in DMEM containing 4500 mg/L D-glucose, L-glutamine, and 110 mg/L sodium pyru...
Ligand InfoPC cidPC sid
In DepthDetails US Patent
TargetReplicase polyprotein 1ab(HCoV-OC43)
Janssen Biopharma
US Patent
LigandPNGBDBM521553(Isopropyl ((((2R,3 S,4R,5R)-5-(4-aminopyrrolo[2,1-...)
Affinity DataEC50: >5.00E+4nM. Assay description: The human β-coronavirus strain OC43 was purchased from ATCC (Manassas, Va.; item numbers VR-1558 and VR-740, respectively). 24 hours prior to do...
Ligand InfoPC cidPC sid
In DepthDetails US Patent