BDBM522155 US11161815, Example 11
SMILES COc1ccc(c(n1)S(=O)(=O)C(C)C)[N+]([O-])=O
InChI Key InChIKey=NUBIOLHAPMEOLX-UHFFFAOYSA-N
Data  2 IC50
  Tab Delimited (TSV)   2D SDfile   Computed 3D by Vconf -m prep SDfile
Find this compound or compounds like it in BindingDB:
Activity Spreadsheet -- Enzyme Inhibition Constant Data from BindingDB
Found 2 hits for monomerid = 522155
TargetGlutathione reductase, mitochondrial(Homo sapiens (Human))
Oblique Therapeutics
US Patent
LigandPNGBDBM522155(US11161815, Example 11)
Affinity DataIC50: >1.00E+5nM. Assay description: Small molecule inhibition of recombinant thioredoxin reductase 1 (TrxR1) and gluthathione reductase (GR) was examined in 96-well plate format. 30 nM ...
Ligand InfoPC cidPC sid
In DepthDetails US Patent
TargetThioredoxin reductase 1, cytoplasmic(Homo sapiens (Human))
Oblique Therapeutics
US Patent
LigandPNGBDBM522155(US11161815, Example 11)
Affinity DataIC50:  204nM. Assay description: Small molecule inhibition of recombinant thioredoxin reductase 1 (TrxR1) and gluthathione reductase (GR) was examined in 96-well plate format. 30 nM ...
Ligand InfoPC cidPC sid
In DepthDetails US Patent