BDBM523447 (+/-)-5-{[(6-Bromo-3-methyl-2-phenylquinolin-4-yl)carbonyl]amino}-4-[2-(difluoromethoxy)phenyl]pentanoic Acid (Racemate)::US11136296, Example 178
SMILES Cc1c(nc2ccc(Br)cc2c1C(=O)NCC(CCC(O)=O)c1ccccc1OC(F)F)-c1ccccc1
InChI Key InChIKey=UNMCQTKROBIVBU-UHFFFAOYSA-N
Data  1 IC50
  Tab Delimited (TSV)   2D SDfile   Computed 3D by Vconf -m prep SDfile
Find this compound or compounds like it in BindingDB:
Activity Spreadsheet -- Enzyme Inhibition Constant Data from BindingDB
Found 1 hit for monomerid = 523447
TargetProstaglandin F2-alpha receptor(Homo sapiens (Human))
Bayer Aktiengesellschaft
US Patent
LigandPNGBDBM523447((+/-)-5-{[(6-Bromo-3-methyl-2-phenylquinolin-4-yl)...)
Affinity DataIC50:  6.5nM. Assay description: For the characterization of test substances in respect of FP antagonism, PGF2α-induced calcium flux in FP-expressing CHEM1 cells (Millipore, HTS...
Ligand InfoPC cidPC sid
In DepthDetails US Patent