BDBM523479 US11136296, Example 210
SMILES Cc1c(nc2ccc(Br)cc2c1C(=O)NC[C@H](CCC(O)=O)c1ccccc1OC(F)(F)F)-c1ccccc1
InChI Key InChIKey=CPMLSSJRQCRYPP-IBGZPJMESA-N
Data  1 IC50
  Tab Delimited (TSV)   2D SDfile   Computed 3D by Vconf -m prep SDfile
Find this compound or compounds like it in BindingDB:
Activity Spreadsheet -- Enzyme Inhibition Constant Data from BindingDB
Found 1 hit for monomerid = 523479
TargetProstaglandin F2-alpha receptor(Homo sapiens (Human))
Bayer Aktiengesellschaft
US Patent
LigandPNGBDBM523479(US11136296, Example 210)
Affinity DataIC50:  6.10nM. Assay description: For the characterization of test substances in respect of FP antagonism, PGF2α-induced calcium flux in FP-expressing CHEM1 cells (Millipore, HTS...
Ligand InfoPC cidPC sid
In DepthDetails US Patent