BDBM523503 (+/-)-5-{[(6-Bromo-3-methyl-2-phenylquinolin-4-yl)carbonyl]amino}-4-(2,3,6-trichlorophenyl)pentanoic Acid (Racemate)::US11136296, Example 234
SMILES Cc1c(nc2ccc(Br)cc2c1C(=O)NCC(CCC(O)=O)c1c(Cl)ccc(Cl)c1Cl)-c1ccccc1
InChI Key InChIKey=POUOMFFJDXCWBR-UHFFFAOYSA-N
Data  1 IC50
  Tab Delimited (TSV)   2D SDfile   Computed 3D by Vconf -m prep SDfile
Find this compound or compounds like it in BindingDB:
Activity Spreadsheet -- Enzyme Inhibition Constant Data from BindingDB
Found 1 hit for monomerid = 523503
TargetProstaglandin F2-alpha receptor(Homo sapiens (Human))
Bayer Aktiengesellschaft
US Patent
LigandPNGBDBM523503((+/-)-5-{[(6-Bromo-3-methyl-2-phenylquinolin-4-yl)...)
Affinity DataIC50:  7.20nM. Assay description: For the characterization of test substances in respect of FP antagonism, PGF2α-induced calcium flux in FP-expressing CHEM1 cells (Millipore, HTS...
Ligand InfoPC cidPC sid
In DepthDetails US Patent