BDBM523822 US11136315, Compound WX020A
SMILES CC(C)(Cc1ccccc1)S(=O)(=O)c1c(Cl)ccc(NC(=O)N[C@H]2CCCc3ccoc23)c1O
InChI Key InChIKey=WWSRDSANJIDRDC-FQEVSTJZSA-N
Data  1 IC50
  Tab Delimited (TSV)   2D SDfile   Computed 3D by Vconf -m prep SDfile
Find this compound or compounds like it in BindingDB:
Activity Spreadsheet -- Enzyme Inhibition Constant Data from BindingDB
Found 1 hit for monomerid = 523822
TargetC-X-C chemokine receptor type 2(Homo sapiens (Human))
Medshine Discovery
US Patent
LigandPNGBDBM523822(US11136315, Compound WX020A)
Affinity DataIC50:  177nM. Assay description: PathHunter CXCR2 β-arrestin cells (DiscoverX) were grown under normal conditions and seeded on a white-walled 384-microwell plate at 20 μL/...
Ligand InfoPC cidPC sid
In DepthDetails US Patent