BDBM524883 US11168095, Example 23
SMILES Cn1nccc1-c1ccc2OCCCCn3cnnc3-c3cccc(NC(=O)c2c1)n3
InChI Key InChIKey=BLNJTAKNCYHAJY-UHFFFAOYSA-N
Data  2 IC50
  Tab Delimited (TSV)   2D SDfile   Computed 3D by Vconf -m prep SDfile
Find this compound or compounds like it in BindingDB:
Activity Spreadsheet -- Enzyme Inhibition Constant Data from BindingDB
Found 2 hits for monomerid = 524883
TargetMitogen-activated protein kinase kinase kinase 5(Homo sapiens (Human))
Biogen Ma
US Patent
LigandPNGBDBM524883(US11168095, Example 23)
Affinity DataIC50: <100nM. Assay description: Table 2: Alternatively, the protein kinase activity of the compounds described herein were tested using the ASK1/MAP3K5 assay by Reaction Biology Cor...
Ligand InfoPC cidPC sid
In DepthDetails US Patent
TargetMitogen-activated protein kinase kinase kinase 5(Homo sapiens (Human))
Biogen Ma
US Patent
LigandPNGBDBM524883(US11168095, Example 23)
Affinity DataIC50: <100nM. Assay description: Table 1: Briefly, 20 μL aliquots of a 1.5× stock of ASK1, STK Substrate 3 and Assay Buffer were distributed in the wells of a white 384 well Opt...
Ligand InfoPC cidPC sid
In DepthDetails US Patent