BDBM524885 US11168095, Example 25
SMILES O=C1Nc2cccc(n2)-c2nncn2CCCCOc2ccc(cc12)-c1ccccn1
InChI Key InChIKey=IVAHBOGPQUZNAQ-UHFFFAOYSA-N
Data  1 IC50
  Tab Delimited (TSV)   2D SDfile   Computed 3D by Vconf -m prep SDfile
Find this compound or compounds like it in BindingDB:
Activity Spreadsheet -- Enzyme Inhibition Constant Data from BindingDB
Found 1 hit for monomerid = 524885
TargetMitogen-activated protein kinase kinase kinase 5(Homo sapiens (Human))
Biogen Ma
US Patent
LigandPNGBDBM524885(US11168095, Example 25)
Affinity DataIC50: <100nM. Assay description: Table 1: Briefly, 20 μL aliquots of a 1.5× stock of ASK1, STK Substrate 3 and Assay Buffer were distributed in the wells of a white 384 well Opt...
Ligand InfoPC cidPC sid
In DepthDetails US Patent