BDBM525132 US11168102, Example 57.
SMILES C[C@@H](Nc1ncnc2n(C)c(=O)c(cc12)C1(F)CCS(=O)(CC1)=NC1CC1)c1cccc(C(F)F)c1F
InChI Key InChIKey=LOJVLBPKNXQGBB-DULYNBRNSA-N
Data  1 IC50  1 Kd
  Tab Delimited (TSV)   2D SDfile   Computed 3D by Vconf -m prep SDfile
Find this compound or compounds like it in BindingDB:
Activity Spreadsheet -- Enzyme Inhibition Constant Data from BindingDB
Found 2 hits for monomerid = 525132
TargetSon of sevenless homolog 1 [564-1049]()
Revolution Medicines
US Patent
LigandPNGBDBM525132(US11168102, Example 57.)
Affinity DataIC50:  7.65nM. Assay description: Using a GE Biacore 8K SPR instrument, avi-tagged SOS1 catalytic domain protein was immobilized to a level of approximately 6000 response units (RU) o...
Ligand InfoPC cidPC sid
In DepthDetails US Patent
TargetSon of sevenless homolog 1 [564-1049]()
Revolution Medicines
US Patent
LigandPNGBDBM525132(US11168102, Example 57.)
Affinity DataKd:  9.19nM. Assay description: The purpose of this assay was to characterize the inhibitory activity of compounds on SOS1 nucleotide exchange of KRAS. Data was reported as IC50 val...
Ligand InfoPC cidPC sid
In DepthDetails US Patent