BDBM525175 4-Methoxy-N-[(1S)-1-[[(3-amino-3-oxo-propyl)-(2-chloroacetyl)amino]carbamoyl]-3-methyl-butyl]-1H-indole-2-carboxamide::WO2022043374, Example 27::WO2022043374, Example 32
SMILES COc1cccc2[nH]c(OC(=O)N[C@@H](CC(C)C)C(=O)NN(CCC(N)=O)C(=O)CCl)cc12
InChI Key InChIKey=AHRRNYZDDSQIBW-HNNXBMFYSA-N
Data  2 IC50
  Tab Delimited (TSV)   2D SDfile   Computed 3D by Vconf -m prep SDfile
Find this compound or compounds like it in BindingDB:
Activity Spreadsheet -- Enzyme Inhibition Constant Data from BindingDB
Found 2 hits for monomerid = 525175
TargetReplicase polyprotein 1ab(2019-nCoV)
F. Hoffmann-La Roche
WIPO
LigandPNGBDBM525175(4-Methoxy-N-[(1S)-1-[[(3-amino-3-oxo-propyl)-(2-ch...)
Affinity DataIC50:  2nM. Assay description: For the SARS-CoV-2 3CLpro assay, 2 μL of 0.02 μM recombinant SARS-CoV-2 3CL protease were mixed with serial dilutions of each c...
Ligand InfoPC cidPC sid
In DepthDetails PubMed
TargetReplicase polyprotein 1ab(2019-nCoV)
F. Hoffmann-La Roche
WIPO
LigandPNGBDBM525175(4-Methoxy-N-[(1S)-1-[[(3-amino-3-oxo-propyl)-(2-ch...)
Affinity DataIC50:  6nM. Assay description: For the SARS-CoV-2 3CLpro assay, 2 μL of 0.02 μM recombinant SARS-CoV-2 3CL protease were mixed with serial dilutions of each c...
Ligand InfoPC cidPC sid
In DepthDetails PubMed