BDBM525205 N-[(1S)-1-[[(3-amino-3-oxo-propyl)-(2-chloroacetyl)amino]carbamoyl]-3-methyl-butyl]-1H-pyrrolo[3,2-c]pyridine-2-carboxamide::WO2022043374, Example 52
SMILES CC(C)C[C@H](NC(=O)c1cc2cnccc2[nH]1)C(=O)NN(CCC(N)=O)C(=O)CCl
InChI Key InChIKey=AFBHFYNKGPHTHJ-AWEZNQCLSA-N
Data  2 IC50
  Tab Delimited (TSV)   2D SDfile   Computed 3D by Vconf -m prep SDfile
Find this compound or compounds like it in BindingDB:
Activity Spreadsheet -- Enzyme Inhibition Constant Data from BindingDB
Found 2 hits for monomerid = 525205
TargetReplicase polyprotein 1ab(2019-nCoV)
A*Star
Curated by ChEMBL
LigandPNGBDBM525205(N-[(1S)-1-[[(3-amino-3-oxo-propyl)-(2-chloroacetyl...)
Affinity DataIC50:  14nM. Assay description: Inhibition of recombinant SARS-CoV-2 3CLpro expressed in Escherichia coli BL21 DE3 using FAM-KTSAVLQSGFRKMEK-TAMRA fluorogenic peptide as substrate p...
Ligand InfoPC cidPC sid
In DepthDetails PubMed
TargetReplicase polyprotein 1ab(2019-nCoV)
A*Star
Curated by ChEMBL
LigandPNGBDBM525205(N-[(1S)-1-[[(3-amino-3-oxo-propyl)-(2-chloroacetyl...)
Affinity DataIC50:  14nM. Assay description: For the SARS-CoV-2 3CLpro assay, 2 μL of 0.02 μM recombinant SARS-CoV-2 3CL protease were mixed with serial dilutions of each c...
Ligand InfoPC cidPC sid
In DepthDetails PubMed