BDBM5254 (3R,4R,5S)-5-amino-3-(azocan-1-yl)-4-acetamidocyclohex-1-ene-1-carboxylic acid::C3-Cyclic Amine Carbocyclic Analogue 4e
SMILES CC(=O)N[C@@H]1[C@@H](N)CC(=C[C@H]1N1CCCCCCC1)C(O)=O
InChI Key InChIKey=HEXKMBDBYKKIII-RRFJBIMHSA-N
Data  2 IC50
  Tab Delimited (TSV)   2D SDfile   Computed 3D by Vconf -m prep SDfile
Find this compound or compounds like it in BindingDB:
Activity Spreadsheet -- Enzyme Inhibition Constant Data from BindingDB
Found 2 hits for monomerid = 5254
TargetNeuraminidase(Influenza B virus (B/Lee/40))
Gilead Sciences
LigandPNGBDBM5254((3R,4R,5S)-5-amino-3-(azocan-1-yl)-4-acetamidocycl...)
Affinity DataIC50:  14nM. Assay description: A standard fluorimetric assay was used to measure influenza virus neuraminidase activity. The substrate 2 -(4-methylumbelliferyl)-alpha-D-acetylneura...
In DepthDetails ArticlePubMed
TargetNeuraminidase(Influenza A virus (A/Puerto Rico/8/34/Mount Sinai(...)
Gilead Sciences
LigandPNGBDBM5254((3R,4R,5S)-5-amino-3-(azocan-1-yl)-4-acetamidocycl...)
Affinity DataIC50:  26nMpH: 6.5 T: 2°C. Assay description: A standard fluorimetric assay was used to measure influenza virus neuraminidase activity. The substrate 2 -(4-methylumbelliferyl)-alpha-D-acetylneura...
In DepthDetails ArticlePubMed