BDBM525851 US11174254, Compound G-12
SMILES COCCOc1ccc(Oc2nc(Nc3cccc(NC(=O)C=C)c3)nc3CNC(=O)c23)cc1
InChI Key InChIKey=OZGYJYPOMUDFCI-UHFFFAOYSA-N
Data  2 IC50
  Tab Delimited (TSV)   2D SDfile   Computed 3D by Vconf -m prep SDfile
Find this compound or compounds like it in BindingDB:
Activity Spreadsheet -- Enzyme Inhibition Constant Data from BindingDB
Found 2 hits for monomerid = 525851
TargetEpidermal growth factor receptor(Homo sapiens (Human))
Yangtze River Pharmaceutical Group
US Patent
LigandPNGBDBM525851(US11174254, Compound G-12)
Affinity DataIC50:  1.53E+3nM. Assay description: The inhibitory activity of compounds to be tested on wild-type EGFR kinase (Invitrogen, PV3872) was measured by z-lyte methods.The working concentrat...
Ligand InfoPC cidPC sid
In DepthDetails US Patent
TargetTyrosine-protein kinase BTK(Homo sapiens (Human))
Yangtze River Pharmaceutical Group
US Patent
LigandPNGBDBM525851(US11174254, Compound G-12)
Affinity DataIC50:  1.35E+3nM. Assay description: The compound was predissolved in 100% DMSO.10 mM drug stock solution was obtained by dissolution at room temperature and then gradiently diluted with...
Ligand InfoPC cidPC sid
In DepthDetails US Patent