BDBM525977 3-(5-(((1S,2S)-2- hydroxycyclohexyl)amino)-1- oxoisoindolin-2-yl)piperidine-2,6-dione::US11185537, Compound I-1
SMILES O[C@H]1CCCC[C@@H]1Nc1ccc2C(=O)N(Cc2c1)C1CCC(=O)NC1=O
InChI Key InChIKey=BLRLCAQMUGCANX-AQOJYXMDSA-N
Data  2 EC50
  Tab Delimited (TSV)   2D SDfile   Computed 3D by Vconf -m prep SDfile
Find this compound or compounds like it in BindingDB:
Activity Spreadsheet -- Enzyme Inhibition Constant Data from BindingDB
Found 2 hits for monomerid = 525977
LigandPNGBDBM525977(3-(5-(((1S,2S)-2- hydroxycyclohexyl)amino)-1- oxoi...)
Affinity DataEC50: >3.00E+4nM. Assay description: The Prolabel system from DiscoverX was used to develop high-throughput and quantitative assays to measure changes in IKZF1, IKZF2, and GSPT1 protein ...
Ligand InfoPC cidPC sid
In DepthDetails US Patent
TargetDNA-binding protein Ikaros(Homo sapiens)
Novartis
US Patent
LigandPNGBDBM525977(3-(5-(((1S,2S)-2- hydroxycyclohexyl)amino)-1- oxoi...)
Affinity DataEC50: >3.00E+4nM. Assay description: The Prolabel system from DiscoverX was used to develop high-throughput and quantitative assays to measure changes in IKZF1, IKZF2, and GSPT1 protein ...
Ligand InfoPC cidPC sid
In DepthDetails US Patent