BDBM526006 3-(5-(((1S,2S)-2- (benzylamino)cyclohexyl)amino)-1- oxoisoindolin-2-yl)piperidine-2,6-dione::US11185537, Compound I-3
SMILES O=C1N(Cc2cc(N[C@H]3CCCC[C@@H]3NCc3ccccc3)ccc12)C1CCC(=O)NC1=O
InChI Key InChIKey=HOPXHPVNNTZZOH-OJSMNCEXSA-N
Data  3 EC50
  Tab Delimited (TSV)   2D SDfile   Computed 3D by Vconf -m prep SDfile
Find this compound or compounds like it in BindingDB:
Activity Spreadsheet -- Enzyme Inhibition Constant Data from BindingDB
Found 3 hits for monomerid = 526006
TargetZinc finger protein Helios(Human)
Novartis
US Patent
LigandPNGBDBM526006(3-(5-(((1S,2S)-2- (benzylamino)cyclohexyl)amino)-1...)
Affinity DataEC50:  29nM. Assay description: The Prolabel system from DiscoverX was used to develop high-throughput and quantitative assays to measure changes in IKZF1, IKZF2, and GSPT1 protein ...
Ligand InfoPC cidPC sid
In DepthDetails US Patent
LigandPNGBDBM526006(3-(5-(((1S,2S)-2- (benzylamino)cyclohexyl)amino)-1...)
Affinity DataEC50: >3.00E+4nM. Assay description: The Prolabel system from DiscoverX was used to develop high-throughput and quantitative assays to measure changes in IKZF1, IKZF2, and GSPT1 protein ...
Ligand InfoPC cidPC sid
In DepthDetails US Patent
TargetDNA-binding protein Ikaros(Homo sapiens)
Novartis
US Patent
LigandPNGBDBM526006(3-(5-(((1S,2S)-2- (benzylamino)cyclohexyl)amino)-1...)
Affinity DataEC50: >3.00E+4nM. Assay description: The Prolabel system from DiscoverX was used to develop high-throughput and quantitative assays to measure changes in IKZF1, IKZF2, and GSPT1 protein ...
Ligand InfoPC cidPC sid
In DepthDetails US Patent