BDBM526123 3-(5-(((1S,2S)-2- (benzyl(methyl)amino)cyclohexyl)(methyl) amino)-1-oxoisoindolin-2-yl) piperidine-2,6-dione::US11185537, Compound I-6
SMILES CN(Cc1ccccc1)[C@H]1CCCC[C@@H]1N(C)c1ccc2C(=O)N(Cc2c1)C1CCC(=O)NC1=O
InChI Key InChIKey=CDSAXYIWGJMEPV-JWDFLIAJSA-N
Data  2 EC50
  Tab Delimited (TSV)   2D SDfile   Computed 3D by Vconf -m prep SDfile
Find this compound or compounds like it in BindingDB:
Activity Spreadsheet -- Enzyme Inhibition Constant Data from BindingDB
Found 2 hits for monomerid = 526123
TargetDNA-binding protein Ikaros(Homo sapiens)
Novartis
US Patent
LigandPNGBDBM526123(3-(5-(((1S,2S)-2- (benzyl(methyl)amino)cyclohexyl)...)
Affinity DataEC50: >5.00E+4nM. Assay description: The Prolabel system from DiscoverX was used to develop high-throughput and quantitative assays to measure changes in IKZF1, IKZF2, and GSPT1 protein ...
Ligand InfoPC cidPC sid
In DepthDetails US Patent
TargetZinc finger protein Helios(Human)
Novartis
US Patent
LigandPNGBDBM526123(3-(5-(((1S,2S)-2- (benzyl(methyl)amino)cyclohexyl)...)
Affinity DataEC50:  43nM. Assay description: The Prolabel system from DiscoverX was used to develop high-throughput and quantitative assays to measure changes in IKZF1, IKZF2, and GSPT1 protein ...
Ligand InfoPC cidPC sid
In DepthDetails US Patent