BDBM5262 (3R,4R,5S)-5-amino-3-{8-azabicyclo[3.2.1]octan-8-yl}-4-acetamidocyclohex-1-ene-1-carboxylic acid::C3-Cyclic Amine Carbocyclic Analogue 4m
SMILES CC(=O)N[C@@H]1[C@@H](N)CC(=C[C@H]1N1C2CCC1CCC2)C(O)=O
InChI Key InChIKey=CBIVFZXLBGGJIX-MMCPYJTDSA-N
Data  2 IC50
  Tab Delimited (TSV)   2D SDfile   Computed 3D by Vconf -m prep SDfile
Find this compound or compounds like it in BindingDB:
Activity Spreadsheet -- Enzyme Inhibition Constant Data from BindingDB
Found 2 hits for monomerid = 5262
TargetNeuraminidase(Influenza B virus (B/Lee/40))
Gilead Sciences
LigandPNGBDBM5262((3R,4R,5S)-5-amino-3-{8-azabicyclo[3.2.1]octan-8-y...)
Affinity DataIC50:  30nM. Assay description: A standard fluorimetric assay was used to measure influenza virus neuraminidase activity. The substrate 2 -(4-methylumbelliferyl)-alpha-D-acetylneura...
In DepthDetails ArticlePubMed
TargetNeuraminidase(Influenza A virus (A/Puerto Rico/8/34/Mount Sinai(...)
Gilead Sciences
LigandPNGBDBM5262((3R,4R,5S)-5-amino-3-{8-azabicyclo[3.2.1]octan-8-y...)
Affinity DataIC50:  32nMpH: 6.5 T: 2°C. Assay description: A standard fluorimetric assay was used to measure influenza virus neuraminidase activity. The substrate 2 -(4-methylumbelliferyl)-alpha-D-acetylneura...
In DepthDetails ArticlePubMed