BDBM526268 3-(1-oxo-5-(((1S,2S)-2-(piperidin-1- yl)cyclopentyl)amino) isoindolin-2-yl)piperidine- 2,6-dione::US11185537, Compound I-14
SMILES O=C1N(Cc2cc(N[C@H]3CCC[C@@H]3N3CCCCC3)ccc12)C1CCC(=O)NC1=O
InChI Key InChIKey=UIDSGVSTCNIPOM-NFBCFJMWSA-N
Data  2 EC50
  Tab Delimited (TSV)   2D SDfile   Computed 3D by Vconf -m prep SDfile
Find this compound or compounds like it in BindingDB:
Activity Spreadsheet -- Enzyme Inhibition Constant Data from BindingDB
Found 2 hits for monomerid = 526268
TargetDNA-binding protein Ikaros(Homo sapiens)
Novartis
US Patent
LigandPNGBDBM526268(3-(1-oxo-5-(((1S,2S)-2-(piperidin-1- yl)cyclopenty...)
Affinity DataEC50: >3.00E+4nM. Assay description: The Prolabel system from DiscoverX was used to develop high-throughput and quantitative assays to measure changes in IKZF1, IKZF2, and GSPT1 protein ...
Ligand InfoPC cidPC sid
In DepthDetails US Patent
TargetZinc finger protein Helios(Human)
Novartis
US Patent
LigandPNGBDBM526268(3-(1-oxo-5-(((1S,2S)-2-(piperidin-1- yl)cyclopenty...)
Affinity DataEC50:  730nM. Assay description: The Prolabel system from DiscoverX was used to develop high-throughput and quantitative assays to measure changes in IKZF1, IKZF2, and GSPT1 protein ...
Ligand InfoPC cidPC sid
In DepthDetails US Patent