BDBM52700 3,5-bis(azanyl)-2-methyl-benzoic acid::3,5-diamino-2-methyl-benzoic acid::3,5-diamino-2-methylbenzoic acid::MLS000703173::SMR000273637::cid_597171
SMILES Cc1c(N)cc(N)cc1C(O)=O
InChI Key InChIKey=RKBQPUFPJRCJKE-UHFFFAOYSA-N
Data  2 EC50
  Tab Delimited (TSV)   2D SDfile   Computed 3D by Vconf -m prep SDfile
Find this compound or compounds like it in BindingDB:
Activity Spreadsheet -- Enzyme Inhibition Constant Data from BindingDB
Found 2 hits for monomerid = 52700
TargetZinc finger protein mex-5(Caenorhabditis elegans)
Broad Institute
Curated by PubChem BioAssay
LigandPNGBDBM52700(3,5-bis(azanyl)-2-methyl-benzoic acid | 3,5-diamin...)
Affinity DataEC50:  2.77E+4nM. Assay description: Broad Institute: MLPCN maternal gene expression Project ID: 2024 Keywords: Zinc finger, C. elegans, maternal gene expression, RNA-protein interac...
In DepthDetails PCBioAssay
TargetPOsterior Segregation(Caenorhabditis elegans)
Broad Institute
Curated by PubChem BioAssay
LigandPNGBDBM52700(3,5-bis(azanyl)-2-methyl-benzoic acid | 3,5-diamin...)
Affinity DataEC50:  3.00E+5nM. Assay description: Broad Institute: MLPCN maternal gene expression Project ID: 2024 Keywords: Zinc finger, C. elegans, maternal gene expression, RNA-protein interac...
In DepthDetails PCBioAssay