BDBM530462 N-(5-Chloro-3-methyl-1H-pyrazol-4-yl)-5-fluoro-4-(3-((S*)-l-hydroxyethyl)-4-methyl-1H-pyrazol-1-yl)-2-(((M-1,1,1-trifluoropropan-2-yl)oxy)benzamide::WO2022070069, Example 5
SMILES C[C@H](O)c1nn(cc1C)-c1cc(O[C@@H](C)C(F)(F)F)c(cc1F)C(=O)Nc1c(C)n[nH]c1Cl
InChI Key
Data  1 IC50
  Tab Delimited (TSV)   2D SDfile   Computed 3D by Vconf -m prep SDfile
Find this compound or compounds like it in BindingDB:
Activity Spreadsheet -- Enzyme Inhibition Constant Data from BindingDB
Found 1 hit for monomerid = 530462
TargetDihydroorotate dehydrogenase (quinone), mitochondrial(Homo sapiens (Human))
Janssen Biotech
WIPO
LigandPNGBDBM530462(N-(5-Chloro-3-methyl-1H-pyrazol-4-yl)-5-fluoro-4-(...)
Affinity DataIC50:  0.260nM. Assay description:  To detect DHODH enzyme activities, dichloroindophenol (DCIP) is added as the final electron acceptor in the assay. DCIP can accept electrons from th...
Ligand InfoPC cidPC sid
In DepthDetails PubMed