BDBM530510 WO2022076764, Example 39
SMILES CCc1cn(c(NC(=O)c2ccc(OC(F)F)cc2)n1)-c1c(F)cc(OC)cc1F
InChI Key InChIKey=PLKKTXGUCLXXHO-UHFFFAOYSA-N
Data  2 EC50
  Tab Delimited (TSV)   2D SDfile   Computed 3D by Vconf -m prep SDfile
Find this compound or compounds like it in BindingDB:
Activity Spreadsheet -- Enzyme Inhibition Constant Data from BindingDB
Found 2 hits for monomerid = 530510
TargetN-formyl peptide receptor 2(Homo sapiens (Human))
Bristol-Myers Squibb
WIPO
LigandPNGBDBM530510(WO2022076764, Example 39)
Affinity DataEC50:  1.00E+3nM
Ligand InfoPC cidPC sid
In DepthDetails PubMed
TargetfMet-Leu-Phe receptor(Homo sapiens (Human))
Bristol-Myers Squibb
WIPO
LigandPNGBDBM530510(WO2022076764, Example 39)
Affinity DataEC50:  21nM
Ligand InfoPC cidPC sid
In DepthDetails PubMed