BDBM530556 1-(3-(difluoromethoxy)phenyl)-3-(4-fluorophenyl)-A-(3-methyl-1,1-dioxidothietan-3-yl)-2-oxo-2,3-dihydro-1H-benzo[d]imidazole-5-carboxamide::WO2022076495, EXAMPLE 2
SMILES CC1(CS(=O)(=O)C1)NC(=O)c1ccc2n(-c3cccc(OC(F)F)c3)c(=O)n(-c3ccc(F)cc3)c2c1
InChI Key InChIKey=FLODPHAEVZFMME-UHFFFAOYSA-N
Data  2 IC50
  Tab Delimited (TSV)   2D SDfile   Computed 3D by Vconf -m prep SDfile
Find this compound or compounds like it in BindingDB:
Activity Spreadsheet -- Enzyme Inhibition Constant Data from BindingDB
Found 1 hit for monomerid = 530556
TargetDiacylglycerol O-acyltransferase 2(Homo sapiens (Human))
Merck Sharp &Amp
WIPO
LigandPNGBDBM530556(1-(3-(difluoromethoxy)phenyl)-3-(4-fluorophenyl)-A...)
Affinity DataIC50:  1.80nM. Assay description: DGAT2 activity was determined by measuring the amount of enzymatic product 13Ci8-triolein (13C-l,2,3-Tri(cis-9-octadecenoyl)glycerol) using the membr...
Ligand InfoPC cidPC sid
In DepthDetails PubMed