BDBM530738 WO2022076496, Example 35
SMILES CC(=O)Nc1ccc(cc1O)N1C(=O)C(C)(C)c2cc(ccc12)C(=O)NC1(C)CS(=O)(=O)C1
InChI Key InChIKey=XNQHNFOQRQKYBG-UHFFFAOYSA-N
Data  1 IC50
  Tab Delimited (TSV)   2D SDfile   Computed 3D by Vconf -m prep SDfile
Find this compound or compounds like it in BindingDB:
Activity Spreadsheet -- Enzyme Inhibition Constant Data from BindingDB
Found 1 hit for monomerid = 530738
TargetDiacylglycerol O-acyltransferase 2(Homo sapiens (Human))
Merck Sharp &Amp
WIPO
LigandPNGBDBM530738(WO2022076496, Example 35)
Affinity DataIC50: >1.00E+3nM
Ligand InfoPC cidPC sid
In DepthDetails PubMed