BDBM531351 2-(6-(((R)-1-((R)-2-Hydroxypropyl)piperidin-3-yl)amino)pyridazin-3-yl)-3-methyl-5-(trifluoromethyl)phenol::US11208399, Example 92b
SMILES C[C@@H](O)CN1CCC[C@H](C1)Nc1ccc(nn1)-c1c(C)cc(cc1O)C(F)(F)F
InChI Key InChIKey=IDELHSXGXMXFQI-UKRRQHHQSA-N
Data  2 IC50
  Tab Delimited (TSV)   2D SDfile   Computed 3D by Vconf -m prep SDfile
Find this compound or compounds like it in BindingDB:
Activity Spreadsheet -- Enzyme Inhibition Constant Data from BindingDB
Found 2 hits for monomerid = 531351
TargetTumor necrosis factor(Homo sapiens (Human))
Novartis
US Patent
LigandPNGBDBM531351(2-(6-(((R)-1-((R)-2-Hydroxypropyl)piperidin-3-yl)a...)
Affinity DataIC50:  4.50E+4nM. Assay description: Monocytic THP-1 cells were maintained according to providers' instructions in RPMI media as described above. Undifferentiated cells were plated a...
Ligand InfoPC cidPC sid
In DepthDetails US Patent
TargetInterleukin-1 beta(Homo sapiens (Human))
Novartis
US Patent
LigandPNGBDBM531351(2-(6-(((R)-1-((R)-2-Hydroxypropyl)piperidin-3-yl)a...)
Affinity DataIC50:  3.60nM. Assay description: Monocytic THP-1 cells (ATCC: TIB-202) were maintained according to providers' instructions in RPMI media (RPMI/Hepes+10% fetal bovine serum+Sodiu...
Ligand InfoPC cidPC sid
In DepthDetails US Patent