BDBM532962 N-[4-[2-[4-ethylsulfonyl-2-(trifluoromethyl)piperazin-1-yl]-6-oxo-1H-pyridin-4-yl]-2-pyridyl]acetamide::US11219618, Example 30
SMILES CCS(=O)(=O)N1CCN(C(C1)C(F)(F)F)c1cc(cc(=O)[nH]1)-c1ccnc(NC(C)=O)c1
InChI Key
Data  1 IC50
  Tab Delimited (TSV)   2D SDfile   Computed 3D by Vconf -m prep SDfile
Find this compound or compounds like it in BindingDB:
Activity Spreadsheet -- Enzyme Inhibition Constant Data from BindingDB
Found 1 hit for monomerid = 532962
TargetPhosphatidylinositol 3-kinase catalytic subunit type 3(Homo sapiens (Human))
Sprint Bioscience
US Patent
LigandPNGBDBM532962(N-[4-[2-[4-ethylsulfonyl-2-(trifluoromethyl)pipera...)
Affinity DataIC50: <5nM. Assay description: Dilution series of compounds of the invention were prepared in DMSO at 100 times the final assay concentration (n1=n0/3 in 10 points). The compounds ...
Ligand InfoPC cidPC sid
In DepthDetails US Patent