BDBM5332 3-{5-[2-(piperidin-1-yl)ethoxy]-1H-indol-2-yl}-1,2-dihydroquinolin-2-one::indolyl quinolinone deriv. 9
SMILES O=c1[nH]c2ccccc2cc1-c1cc2cc(OCCN3CCCCC3)ccc2[nH]1
InChI Key InChIKey=IFNGRZXJQFDVBD-UHFFFAOYSA-N
Data  1 IC50
  Tab Delimited (TSV)   2D SDfile   Computed 3D by Vconf -m prep SDfile
Find this compound or compounds like it in BindingDB:
Activity Spreadsheet -- Enzyme Inhibition Constant Data from BindingDB
Found 1 hit for monomerid = 5332
TargetVascular endothelial growth factor receptor 2(Homo sapiens (Human))
Merck Research Laboratories
LigandPNGBDBM5332(3-{5-[2-(piperidin-1-yl)ethoxy]-1H-indol-2-yl}-1,2...)
Affinity DataIC50:  4nMpH: 7.4 T: 2°C. Assay description: Activated KDR was incubated with 25 uM/10 uCi of [gamma-33P] ATP, poly-Glu/Tyr, and inhibitors in kinase buffer for 15 min at 22 °C. The reactio...
In DepthDetails ArticlePubMed