BDBM5347 5-phenyl-N-(pyridin-3-yl)-1,3-thiazol-2-amine::aminothiazole 7
SMILES N(c1ncc(s1)-c1ccccc1)c1cccnc1
InChI Key InChIKey=UJAUYVIPBCEGLD-UHFFFAOYSA-N
Data  1 IC50
  Tab Delimited (TSV)   2D SDfile   Computed 3D by Vconf -m prep SDfile
Find this compound or compounds like it in BindingDB:
Activity Spreadsheet -- Enzyme Inhibition Constant Data from BindingDB
Found 1 hit for monomerid = 5347
TargetVascular endothelial growth factor receptor 2(Homo sapiens (Human))
Merck Research Laboratories
LigandPNGBDBM5347(5-phenyl-N-(pyridin-3-yl)-1,3-thiazol-2-amine | am...)
Affinity DataIC50:  240nMpH: 7.4 T: 2°C. Assay description: Activated KDR was incubated with 25 uM/10 uCi of [gamma-33P] ATP, poly-Glu/Tyr, and inhibitors in kinase buffer for 15 min at 22 °C. The reactio...
In DepthDetails ArticlePubMed