BDBM537204 US11897851, Compound 189
SMILES NS(=O)(=O)c1ccc(Cc2c(CC3CC3)n(nc2-c2ccc(F)c(c2)C(=C)C(F)(F)F)-c2nc(cs2)C(O)=O)cc1F
InChI Key InChIKey=GKLWWJHVIGCDRX-UHFFFAOYSA-N
Data  1 EC50
  Tab Delimited (TSV)   2D SDfile   Computed 3D by Vconf -m prep SDfile
Find this compound or compounds like it in BindingDB:
Activity Spreadsheet -- Enzyme Inhibition Constant Data from BindingDB
Found 1 hit for monomerid = 537204
TargetGlucagon-like peptide 1 receptor(Homo sapiens (Human))
Gasherbrum Bio
US Patent
LigandPNGBDBM537204(US11897851, Compound 189)
Affinity DataEC50:  0.0220nM. Assay description: To optimize functional activity directed toward Gas coupling, a HEK293/CRE-Luc cell line developed by HDB stably expressing the GLP-1 Receptor was us...
Ligand InfoPC cidPC sid
In DepthDetails US Patent