BDBM5401 2,4-Disubstituted Pyrimidine 5c::3-(1-{2-[(3,5-dimethylphenyl)amino]pyrimidin-4-yl}-1H-imidazol-2-yl)-1-oxidopyridin-1-ium
SMILES Cc1cc(C)cc(Nc2nccc(n2)-n2ccnc2-c2ccc[n+]([O-])c2)c1
InChI Key InChIKey=LPUMVYSUHSFPNJ-UHFFFAOYSA-N
Data  1 IC50
  Tab Delimited (TSV)   2D SDfile   Computed 3D by Vconf -m prep SDfile
Find this compound or compounds like it in BindingDB:
Activity Spreadsheet -- Enzyme Inhibition Constant Data from BindingDB
Found 1 hit for monomerid = 5401
TargetVascular endothelial growth factor receptor 2(Homo sapiens (Human))
Merck Research Laboratories
LigandPNGBDBM5401(2,4-Disubstituted Pyrimidine 5c | 3-(1-{2-[(3,5-di...)
Affinity DataIC50:  1.41E+3nMpH: 7.4 T: 2°C. Assay description: Activated KDR was incubated with 25 uM/10 uCi of [gamma-33P] ATP, poly-Glu/Tyr, and inhibitors in kinase buffer for 15 min at 22 °C. The reactio...
In DepthDetails ArticlePubMed